{"text_format":"3","workbook":"xlsx","n_sheets":41,"sheets":["Mechanics","Index","Intro","How it works","Suspects","Elimination Grid","Sweepstake","Puzzle 1A","Puzzle 1B","Puzzle 2","Puzzle 3A","Puzzle 3B","Puzzle 4","Puzzle 5A","Puzzle 5B","Puzzle 6","Puzzle 7A","Puzzle 7B","Puzzle 8A","Puzzle 8B","Puzzle 9A","Puzzle 9B","Puzzle 10A","Puzzle 10B","Puzzle 11A","Puzzle 11B","Puzzle 12","Accusation","Confession","Solutions","Other Games","Bonus Puzzle","Suspects_R","Elimination Grid_R","Puzzle 2_R","Puzzle 4_R","Puzzle 5B_R","Puzzle 7B_R","Puzzle 9B_R","Puzzle 12_R","Bonus Puzzle_R"],"not_rendered":{"images":10,"macros":1,"external_links":2,"defined_names":13,"comments":2},"read":"whole","date_system":"1900"}

{"sheet":"Mechanics","index":0,"n_rows":45,"n_cols":7,"rows_kept":45,"hidden":true}
["Formal Accusation:",0,"Text from lookup",null,"MONSTER INTRO LOOKUP"]
["First Accused Item:",0,{"$f":"VLOOKUP(FIRSTACCUSEDITEM,$E$10:$F$28,2,FALSE)","v":"Nothing Accused"},null,"SIR HAMISH HOGWASH","Chief Pumpkin Supply Agent","How do you do. I am Sir Hamish Hogwash, aged 60. The Hogwash family own the island of Tunga Wonga in the far off Pacific ocean. It is on this island that the Pungent Pumpkins grow. I sell these pumpkins to the Pungent Pumpkin Processing Company, and am therefore their Chief Pumpkin Supply Agent. I did not much like Clifton. I do not feel he paid me a fair price for my pumpkins. And neither did I like his personal habits – he was always scratching between his toes!"]
["Second Accused Item:",0,{"$f":"VLOOKUP(SECONDACCUSEDITEM,$E$10:$F$28,2,FALSE)","v":"Nothing Accused"},null,"PROFESSOR EMMELIUS BUNSEN","Research & Development Director","Ah, hello there. I am Professor Bunsen, the Research & Development Director of the Pungent Pumpkin Processing Company. I am responsible for creating all the exciting and diverse products derived from the pungent pumpkin. Clifton was my step-brother. We each owned 24% of the shares in the company. I assume that his shares will now come to me. With Clifton having all the business expertise and commercial knowledge, I sometimes felt a little overshadowed by my step-brother. But I am sincerely sorry that he is dead."]
["Third Accused Item:",0,{"$f":"VLOOKUP(THIRDACCUSEDITEM,$E$10:$F$28,2,FALSE)","v":"Nothing Accused"},null,"LADY 'BEAUTY' FADING","Chief Shareholder & Chairwoman","I am Lady “Beauty” Fading and my heart is broken! Clifton Curry was my boyfriend and the man I intended to marry. We met in St Tropez when I was cruising on my yacht (I am a very wealthy divorcee). And we hit it off at once. He was, of course, a few years younger than myself, but that didn’t matter to either of us. To show my love for him, I provided half of the funding for the Pungent Pumpkin Processing Company. I am therefore the Chief Shareholder and own 52% of the shares. But I would surrender them all to have my boyfriend back for just a minute!"]
[{"$nulls":4},"MAVIS CHEEK","Directors’ Secretary","Good day. I am Mavis Cheek, secretary to the directors of the Pungent Pumpkin Processing Company.  I am very efficient and intelligent, and able to wrap my bosses around my little finger! I am really the power behind the scenes, and most of Clifton’s success was due to me. Precious little thanks I got from him though. I hate ingratitude! Still, now he is dead, I will come into my own. I am sure Professor Bunsen will give me a free hand, and I will effectively be the Managing Director of the company! With remuneration to match! "]
["Treat Answers",{"$nulls":3},"GIGI SPARKLE","Marketing Consultant","Ciao darling! I am Gigi Sparkle, creative force behind the “Super Sparkle” Marketing Agency. I provide all the marketing for the Pungent Pumpkin Processing Company – which includes hiring the celebrated hurdler Lloyd Lunchbox to be the face of Pungent Pumpkin Products! Clifton was incredibly impressed by this. Although some people say I am a ruthless, vengeful businesswoman, I am really sad that Clifton is dead – even though he was extremely forgetful about paying my invoices!"]
["Player Answer","Actual Answer","Are they the same?",null,"LLOYD LUNCHBOX","Commonwealth Games’ Hurdler","High five buddy! I am Lloyd Lunchbox, a silver medallist hurdler from the Commonwealth Games. I have been signed up by Gigi Sparkle to be the face of the Pungent Pumpkin Processing Company – and to recommend their products wherever I go. It is not exactly my first choice of sponsorship, but a recent drug scandal has affected my marketability. Fortunately I got my ban overturned. I am shocked by Clifton Curry’s death, but I can’t afford to let it interfere with my training and quest for gold at the next Olympics."]
[null,null,{"$f":"A8=B8","v":true}]
[null,null,{"$f":"A9=B9","v":true}]
[null,null,{"$f":"A10=B10","v":true},null,0,"Nothing Accused"]
[null,null,true,null,1,"Sir Hamish Hogwash"]
[{"$nulls":4},2,"Professor Emmelius Bunsen"]
["Monster Name Dropdown",{"$nulls":3},3,"Lady 'Beauty Fading'"]
["SIR HAMISH HOGWASH",{"$nulls":3},4,"Mavis Cheek"]
["PROFESSOR EMMELIUS BUNSEN",{"$nulls":3},5,"Gigi Sparkle"]
["LADY 'BEAUTY' FADING",{"$nulls":3},6,"Lloyd Lunchbox"]
["MAVIS CHEEK",{"$nulls":3},7,"Athlete's Foot Cream"]
["GIGI SPARKLE",{"$nulls":3},8,"Industrial Strength Face Cream"]
["LLOYD LUNCHBOX",{"$nulls":3},9,"Love Potion"]
[{"$nulls":4},10,"Irresistible Aftershave"]
[{"$nulls":4},11,"Salami Sauce"]
[{"$nulls":4},12,"Stamina Drug"]
[{"$nulls":4},13,"Financial Gain"]
[{"$nulls":4},14,"Hate"]
[{"$nulls":4},15,"Homicidal Mania"]
[{"$nulls":4},16,"Jealousy"]
[{"$nulls":4},17,"Tragic Accident"]
[{"$nulls":4},18,"Vengeance"]
[]
[]
[]
[{"$nulls":4},"Puzzles and what they eliminate"]
[{"$nulls":4},1]
[{"$nulls":4},2]
[{"$nulls":4},3]
[{"$nulls":4},4]
[{"$nulls":4},5]
[{"$nulls":4},6]
[{"$nulls":4},7]
[{"$nulls":4},8]
[{"$nulls":4},9]
[{"$nulls":4},10]
[{"$nulls":4},11]
[{"$nulls":4},12]
[{"$nulls":4},"Solution"]

{"sheet":"Index","index":1,"n_rows":5,"n_cols":7,"rows_kept":5}
[]
[{"$nulls":6},"THE PUNGENT PUMPKIN POISONER MURDER MYSTERY PUZZLE BOOK"]
[]
[]
[{"$nulls":6},"INDEX"]

{"sheet":"Intro","index":2,"n_rows":14,"n_cols":3,"rows_kept":14,"merged":[[2,2,2,3],[3,2,3,3],[5,2,5,3],[6,2,6,3],[7,2,7,3],[8,2,8,3],[10,2,10,3],[11,2,11,3],[12,2,12,3],[13,2,13,3]]}
[null,null,"ABOUT THE PUNGENT PUMPKIN PROCESSING COMPANY"]
[]
[null,null,"Formed exactly a year ago today, the company’s purpose is to develop and sell a diverse range of commercial and industrial products derived from that fantastic freak of nature, the Pungent Pumpkin of Tunga Wonga."]
[null,null,"MEMBERS OF THE COMPANY"]
[]
[null,null,"Clifton Curry - Managing Director"]
[null,null,"Professor Emmelius Bunsen - Research and Development Director"]
[null,null,"Lady 'Beauty' Fading - Chairwoman and Chief Shareholder"]
[null,null,"Mavis Cheek - Directors' Secretary"]
[]
[null,null,"COMPANY HISTORY\n \nThe first two Pungent Pumpkin products hit the marketplace earlier this year to tremendous acclaim.  Pungent Pumpkin Oven Cleaner can now be found in every respectable kitchen in the land, while Pungent Pumpkin Battery Acid has revolutionised the transport industry.  However the company is very excited by the imminent launch of their next two world class products, Pungent Pumpkin Athlete's Foot Cream and Pungent Pumpkin Salami Sauce.\n"]
[null,null,"MARKETING\n \nA fabulous launch campaign for these products has been created by Gigi Sparkle, creative force behind the “Super Sparkle” marketing agency.  Gigi has successfully signed up top sports star Lloyd Lunchbox to be the new face of Pungent Pumpkin Products.  Soon Lloyd will be seen treating his feet with Athlete’s Foot Cream on billboards all around the country.\n"]
[null,null,"SUPPLY\n \nThe continued provision of pumpkins to the company looks secure, due to the hard work and endeavours of Chief Supply Agent, Sir Hamish Hogwash.\n"]
[null,null,"FURTHER PRODUCT DEVELOPMENT\n \nA whole host of exciting new products are waiting in the pipeline, including such diverse items as Aftershave, Face Lift Cream, Cotton Dye and Rat Poison.\n"]

{"sheet":"How it works","index":3,"n_rows":1,"n_cols":3,"rows_kept":1}
[null,null,"HOW TO SOLVE THE CASE"]

{"sheet":"Suspects","index":4,"n_rows":18,"n_cols":5,"rows_kept":18}
[null,null,"MEET THE SUSPECTS"]
[]
[{"$nulls":3},"Click on the suspect's name below and use the drop-down box to meet another suspect"]
[{"$nulls":3},"LLOYD LUNCHBOX"]
[]
[{"$nulls":3},{"$f":"VLOOKUP($D$4,$C$13:$E$18,2,FALSE)","v":"Commonwealth Games’ Hurdler"}]
[{"$nulls":3},{"$f":"VLOOKUP($D$4,$C$13:$E$18,3,FALSE)","v":"High five buddy! I am Lloyd Lunchbox, a silver medallist hurdler from the Commonwealth Games. I have been signed up by Gigi Sparkle to be the face of the Pungent Pumpkin Processing Company – and to recommend their products wherever I go. It is not exactly my first choice of sponsorship, but a recent drug scandal has affected my marketability. Fortunately I got my ban overturned. I am shocked by Clifton Curry’s death, but I can’t afford to let it interfere with my training and quest for gold at the next Olympics."}]
[]
[]
[]
[]
[]
[null,null,"SIR HAMISH HOGWASH","Chief Pumpkin Supply Agent","How do you do. I am Sir Hamish Hogwash, aged 60. The Hogwash family own the island of Tunga Wonga in the far off Pacific ocean. It is on this island that the Pungent Pumpkins grow. I sell these pumpkins to the Pungent Pumpkin Processing Company, and am therefore their Chief Pumpkin Supply Agent. I did not much like Clifton. I do not feel he paid me a fair price for my pumpkins. And neither did I like his personal habits – he was always scratching between his toes!"]
[null,null,"PROFESSOR EMMELIUS BUNSEN","Research & Development Director","Ah, hello there. I am Professor Bunsen, the Research & Development Director of the Pungent Pumpkin Processing Company. I am responsible for creating all the exciting and diverse products derived from the pungent pumpkin. Clifton was my step-brother. We each owned 24% of the shares in the company. I assume that his shares will now come to me. With Clifton having all the business expertise and commercial knowledge, I sometimes felt a little overshadowed by my step-brother. But I am sincerely sorry that he is dead."]
[null,null,"LADY 'BEAUTY' FADING","Chief Shareholder & Chairwoman","I am Lady “Beauty” Fading and my heart is broken! Clifton Curry was my boyfriend and the man I intended to marry. We met in St Tropez when I was cruising on my yacht (I am a very wealthy divorcee). And we hit it off at once. He was, of course, a few years younger than myself, but that didn’t matter to either of us. To show my love for him, I provided half of the funding for the Pungent Pumpkin Processing Company. I am therefore the Chief Shareholder and own 52% of the shares. But I would surrender them all to have my boyfriend back for just a minute!"]
[null,null,"MAVIS CHEEK","Directors’ Secretary","Good day. I am Mavis Cheek, secretary to the directors of the Pungent Pumpkin Processing Company.  I am very efficient and intelligent, and able to wrap my bosses around my little finger! I am really the power behind the scenes, and most of Clifton’s success was due to me. Precious little thanks I got from him though. I hate ingratitude! Still, now he is dead, I will come into my own. I am sure Professor Bunsen will give me a free hand, and I will effectively be the Managing Director of the company! With remuneration to match! "]
[null,null,"GIGI SPARKLE","Marketing Consultant","Ciao darling! I am Gigi Sparkle, creative force behind the “Super Sparkle” Marketing Agency. I provide all the marketing for the Pungent Pumpkin Processing Company – which includes hiring the celebrated hurdler Lloyd Lunchbox to be the face of Pungent Pumpkin Products! Clifton was incredibly impressed by this. Although some people say I am a ruthless, vengeful businesswoman, I am really sad that Clifton is dead – even though he was extremely forgetful about paying my invoices!"]
[null,null,"LLOYD LUNCHBOX","Commonwealth Games’ Hurdler","High five buddy! I am Lloyd Lunchbox, a silver medallist hurdler from the Commonwealth Games. I have been signed up by Gigi Sparkle to be the face of the Pungent Pumpkin Processing Company – and to recommend their products wherever I go. It is not exactly my first choice of sponsorship, but a recent drug scandal has affected my marketability. Fortunately I got my ban overturned. I am shocked by Clifton Curry’s death, but I can’t afford to let it interfere with my training and quest for gold at the next Olympics."]

{"sheet":"Elimination Grid","index":5,"n_rows":11,"n_cols":8,"rows_kept":11}
[null,null,"ELIMINATION GRID"]
[]
[null,null,"Suspects",{"$nulls":4},"Click on a suspect/item to eliminate them. Click again to cancel your elimination."]
[null,null,"Sir Hamish Hogwash","Professor\nEmmelius Bunsen","Lady 'Beauty' Fading","Mavis\nCheek","Gigi\nSparkle","Lloyd\nLunchbox"]
[null,null,"Pungent Pumpkin Products"]
[null,null,"Athlete's Foot Cream*","Industrial Strength Face Cream*","Love Potion","Irresistible Aftershave*","Salami\nSauce","Stamina\nDrug"]
[null,null,"Motives",null,"POTION"]
[null,null,"Financial\nGain","Hate","Homicidal\nMania","Jealousy","Tragic\nAccident","Vengeance"]
[null,null,"* Pungent Pumpkin Rat Poison is so deadly it can kill even when absorbed through the skin."]
[]
[{"$nulls":7},"www.merrymurder.com"]

{"sheet":"Sweepstake","index":6,"n_rows":21,"n_cols":5,"rows_kept":21,"merged":[[3,2,8,2],[9,2,14,2],[15,2,20,2]]}
[null,null,"MERRYMURDER SWEEPSTAKE"]
[]
[{"$nulls":3},"ITEM","SELECTED BY"]
[null,null,"SUSPECTS","Sir Hamish Hogwash"]
[{"$nulls":3},"Professor Bunsen"]
[{"$nulls":3},"Lady Fading"]
[{"$nulls":3},"Mavis Cheek"]
[{"$nulls":3},"Gigi Sparkle"]
[{"$nulls":3},"Lloyd Lunchbox"]
[null,null,"PUMPKIN PRODUCTS","Athlete's Foot Cream"]
[{"$nulls":3},"Face Cream"]
[{"$nulls":3},"Love Potion"]
[{"$nulls":3},"Irresistible Aftershave"]
[{"$nulls":3},"Salami Sauce"]
[{"$nulls":3},"Stamina Drug"]
[null,null,"MOTIVES","Financial Gain"]
[{"$nulls":3},"Hate"]
[{"$nulls":3},"Homicidal Mania"]
[{"$nulls":3},"Jealousy"]
[{"$nulls":3},"Tragic Accident"]
[{"$nulls":3},"Vengeance"]

{"sheet":"Puzzle 1A","index":7,"n_rows":1,"n_cols":3,"rows_kept":1}
[null,null,"01 - SIR HAMISH HOGWASH'S POISONED PUMPKIN MAZE"]

{"sheet":"Puzzle 1B","index":8,"n_rows":1,"n_cols":3,"rows_kept":1}
[null,null,"01 - SIR HAMISH HOGWASH'S POISONED PUMPKIN MAZE"]

{"sheet":"Puzzle 2","index":9,"n_rows":20,"n_cols":21,"rows_kept":20}
[null,null,"02 - SMELLY WORD SEARCH"]
[]
[]
[]
[null,null,"C","S","H","D","A","E","R","B","H","S","E","R","F","S","A",null,null,"SMELLY ITEMS!"]
[null,null,"P","I","O","L","A","R","O","T","T","E","N","E","G","G","S",null,"APPLE PIE","HONEYSUCKLE","ROSEMARY"]
[null,null,"I","L","N","S","L","A","T","I","P","S","O","H","M","L","I",null,"BACON","HOSPITALS","ROSES"]
[null,null,"N","A","E","N","T","S","O","P","M","O","C","T","L","U","N",null,"BUTTERSCOTCH","LEATHER","ROTTEN EGGS"]
[null,null,"E","G","Y","R","A","M","E","S","O","R","S","A","S","E","R",null,"CHEESE","NEW BOOKS","SCENT"]
[null,null,"C","E","S","C","S","M","A","R","U","K","B","E","L","P","E",null,"CINNAMON","NEW TENNIS BALLS","SILAGE"]
[null,null,"O","C","U","O","E","P","O","E","U","S","C","L","H","I","T",null,"COFFEE","PAINT","SKUNK"]
[null,null,"N","S","C","F","A","E","E","N","I","L","O","S","A","G","T",null,"COMPOST","PEANUT BUTTER","SOAP"]
[null,null,"E","K","K","F","G","P","K","N","I","P","W","E","A","F","U",null,"FRESH BREAD","PEPPERMINT","SOCKS"]
[null,null,"S","O","L","E","O","P","N","I","F","E","E","R","S","E","B",null,"FRESH MOWN LAWN","PIG FEED","SWEAT"]
[null,null,"E","O","E","E","D","E","O","D","A","U","L","L","P","E","T",null,"GARLIC","PINE CONES","VANILLA"]
[null,null,"E","B","P","L","T","R","C","T","N","I","A","P","P","D","U",null,"GASOLINE","POLLEN","WET DOG"]
[null,null,"H","W","Y","W","E","M","A","S","C","E","N","T","A","P","N",null,"GLUE","ROAST DINNER"]
[null,null,"C","E","E","G","W","I","B","A","V","A","N","I","L","L","A"]
[null,null,"E","N","W","A","L","N","W","O","M","H","S","E","R","F","E"]
[null,null,"N","T","B","U","T","T","E","R","S","C","O","T","C","H","P"]

{"sheet":"Puzzle 3A","index":10,"n_rows":1,"n_cols":3,"rows_kept":1}
[null,null,"03 – MAVIS CHEEK’S 'TAKE A LETTER' PUZZLE"]

{"sheet":"Puzzle 3B","index":11,"n_rows":27,"n_cols":13,"rows_kept":27}
[null,null,"03 – MAVIS CHEEK’S 'TAKE A LETTER' PUZZLE"]
[]
[]
[]
[]
[]
[{"$nulls":12},"WHICH COMPANY SUCCESSFULLY DELIVERS THEIR LETTER?"]
[{"$nulls":12},"MEGAPOST LIMITED?"]
[{"$nulls":12},"eliminate"]
[{"$nulls":12},"Athlete's Foot Cream"]
[{"$nulls":12},"and"]
[{"$nulls":12},"Vengeance"]
[{"$nulls":12},"DIRECT DELIVERIES?"]
[{"$nulls":12},"eliminate"]
[{"$nulls":12},"Homicidal Mania"]
[{"$nulls":12},"and"]
[{"$nulls":12},"Jealousy"]
[{"$nulls":12},"COSY COURIERS?"]
[{"$nulls":12},"eliminate"]
[{"$nulls":12},"Face Cream"]
[{"$nulls":12},"and"]
[{"$nulls":12},"Hate"]
[{"$nulls":12},"THE PUNCTUAL POST PEOPLE?"]
[{"$nulls":12},"eliminate"]
[{"$nulls":12},"Financial Gain"]
[{"$nulls":12},"and"]
[{"$nulls":12},"Stamina Drug"]

{"sheet":"Puzzle 4","index":12,"n_rows":11,"n_cols":13,"rows_kept":11}
[null,null,"04 - NUMBER CRUNCHING"]
[]
[null,null,20,"÷",null,"=",4,null,null,"-",12,"=",16]
[null,null,"x",null,"x",{"$nulls":3},"÷",{"$nulls":3},"+"]
[null,null,3,null,12,"÷",6,"x",null,"x",3,"="]
[null,null,"=",null,"÷",{"$nulls":3},"=",{"$nulls":3},"+"]
[{"$nulls":3},"+",null,"-",null,"+",4,"-",39,"="]
[{"$nulls":4},"=",null,"-",{"$nulls":3},"÷",null,"-"]
[null,null,12,"+",null,"=",18,null,4,"x",null,"="]
[{"$nulls":6},"=",{"$nulls":3},"=",null,"="]
[null,null,2,"x",3,"x",null,"=",54,null,3]

{"sheet":"Puzzle 5A","index":13,"n_rows":1,"n_cols":3,"rows_kept":1}
[null,null,"05 – LADY FADING’S BEAUTY PRODUCT JIG"]

{"sheet":"Puzzle 5B","index":14,"n_rows":41,"n_cols":22,"rows_kept":41}
[null,null,"05 – LADY FADING’S BEAUTY PRODUCT JIG"]
[]
[{"$nulls":19},"BEAUTY PRODUCTS"]
[{"$nulls":18},"3 Letters","6 Letters","8 Letters"]
[{"$nulls":18},"DYE","LASHES","EYELINER"]
[{"$nulls":18},"GEL","LOTION","LIPSTICK"]
[{"$nulls":18},"4 Letters","POWDER","9 Letters"]
[{"$nulls":18},"WASH","PRIMER","BATH SALTS"]
[{"$nulls":18},"5 Letters","7 Letters","COLD CREAM"]
[{"$nulls":18},"BOTOX","BLUSHER","CONCEALER"]
[{"$nulls":18},"CREAM","BRONZER","EXFOLIANT"]
[{"$nulls":18},"GLOSS","EYE PACK","FACE CREAM"]
[{"$nulls":18},"PAINT","GLITTER","FACEMASKS"]
[{"$nulls":18},"ROUGE","LACQUER","HAIRSPRAY"]
[{"$nulls":18},"TINTS","LIP BALM","10 Letters"]
[{"$nulls":18},"TONER","MASCARA","BUBBLE BATH"]
[{"$nulls":18},"WIPES","MUDPACK","FACE POWDER"]
[{"$nulls":15},"X",{"$nulls":3},"PERFUME","FOUNDATION"]
[{"$nulls":19},"SHAMPOO","LIP PLUMPER"]
[{"$nulls":18},"11 Letters","VARNISH","NAIL POLISH"]
[{"$nulls":18},"SCENTED SOAP","COCOA BUTTER","MOISTURISER"]
[{"$nulls":18},"13 Letters","EYE BRIGHTENER"]
[]
[{"$nulls":13},"S"]
{"$rows_empty":16}
[{"$nulls":21},"VARNISH"]

{"sheet":"Puzzle 6","index":15,"n_rows":26,"n_cols":11,"rows_kept":26,"merged":[[20,7,20,10]]}
[null,null,"06 – NEW PRODUCT DEVELOPMENT"]
[]
[null,null,"SHAMPOO","FLOOR POLISH","CRICKET BAT OIL","SLUG PELLETS"]
[null,null,"(BEAUTY)","(CLEANING)","(MISCELLANEOUS)","(PEST CONTROL)"]
[null,null,"Possibility","Possibility","Possibility","Possibility"]
[null,null,"KETTLE DESCALER","FLY KILLER","TEETH WHITENER","MUSCLE BUILDING POWDER"]
[null,null,"(CLEANING)","(PEST CONTROL)","(BEAUTY)","(MISCELLANEOUS)"]
[null,null,"Possibility","Possibility","Possibility","Possibility"]
[null,null,"TEABAGS","HAIR LIGHTENER","MOSQUITO REPELLANT","WASHING UP LIQUID"]
[null,null,"(MISCELLANEOUS)","(BEAUTY)","(PEST CONTROL)","(CLEANING)"]
[null,null,"Possibility","Possibility","Possibility","Possibility"]
[null,null,"WEED KILLER","BOOT POLISH","CARPET CLEANER","DEODORANT"]
[null,null,"(PEST CONTROL)","(MISCELLANEOUS)","(CLEANING)","(BEAUTY)"]
[null,null,"Possibility","Possibility","Possibility","Possibility"]
[null,null,"DRAIN UNBLOCKER","NAIL VARNISH","MILDEW ERADICATOR","WART REMOVAL CREAM"]
[null,null,"(CLEANING)","(BEAUTY)","(PEST CONTROL)","(MISCELLANEOUS)"]
[null,null,"Possibility","Possibility","Possibility","Possibility"]
[null,null,"EYE BRIGHTENER","STAIN REMOVER","ANT POWDER","ESSENTIAL OIL"]
[null,null,"(BEAUTY)","(CLEANING)","(PEST CONTROL)","(MISCELLANEOUS)"]
[null,null,"Possibility","Possibility","Possibility","Possibility"]
[null,null,"WOODWORM REMOVER","DISINFECTANT","MIRROR SPARKLE SPRAY","HAIR REMOVAL CREAM",null,"WHICH TYPE OF PRODUCT WILL BE DEVELOPED NEXT?"]
[null,null,"(PEST CONTROL)","(MISCELLANEOUS)","(CLEANING)","(BEAUTY)",null,"PEST CONTROL?","CLEANING?","BEAUTY?","MISCELLANEOUS?"]
[null,null,"Possibility","Possibility","Possibility","Possibility",null,"eliminate","eliminate","eliminate","eliminate"]
[null,null,"MOUSTACHE POMADE","PARROT CAGE CLEANER","WASP SPRAY","FURNITURE POLISH",null,"PROFESSOR\nBUNSEN","LLOYD\nLUNCHBOX","MAVIS\nCHEEK","GIGI\nSPARKLE"]
[null,null,"(BEAUTY)","(MISCELLANEOUS)","(PEST CONTROL)","(CLEANING)"]
[null,null,"Possibility","Possibility","Possibility","Possibility"]

{"sheet":"Puzzle 7A","index":16,"n_rows":1,"n_cols":3,"rows_kept":1}
[null,null,"07 – PROFESSOR BUNSEN’S FANTASTIC FABRIC"]

{"sheet":"Puzzle 7B","index":17,"n_rows":18,"n_cols":18,"rows_kept":18}
[null,null,"07 – PROFESSOR BUNSEN’S FANTASTIC FABRIC"]
[]
[null,null,"J","A","R","G","N","E","G","C","D","A","O","R",null,null,"FANTASTIC FABRICS"]
[null,null,"W","O","I","E","O","R","A","L","O","E","Z","B",null,"ARGENTAN LACE","EGYPTIAN COTTON","MUSLIN"]
[null,null,"S","R","A","N","D","G","E","T","T","E","T","E",null,"BENGALINE SILK","FAUX FUR","OILSKIN"]
[null,null,"T","E","H","T","L","A","A","W","H","I","N","N",null,"BROADCLOTH","FLANNELETTE","POLAR FLEECE"]
[null,null,"L","D","S","A","N","C","E","E","C","U","S","G",null,"CAMELS HAIR","GABARDINE","SAILCLOTH"]
[null,null,"O","W","L","E","L","I","D","O","U","M","L","A",null,"CHINTZ","GEORGETTE","TAFFETA"]
[null,null,"O","S","E","C","S","O","J","A","G","Y","I","H",null,"CREPE DE CHINE","IRISH LINEN","VELVET"]
[null,null,"L","H","M","A","K","R","A","B","A","E","N","C",null,"DONEGAL TWEED","JACQUARD KNIT","WORSTED WOOL"]
[null,null,"I","S","I","R","I","D","C","Q","I","S","F","E",null,"DRUGGET","LEATHER"]
[null,null,"N","H","T","O","N","T","E","U","L","T","T","D"]
[null,null,"E","N","E","L","E","T","G","A","K","N","I","E"]
[null,null,"E","N","L","C","O","P","Y","R","D","R","S","P"]
[null,null,"S","A","I","A","L","T","I","A","N","C","R","E"]
[null,null,"H","L","F","R","U","A","F","F","E","O","A","V"]
[null,null,"E","E","D","F","X","E","N","O","T","T","E","V"]
[null,null,"C","E","R","U","G","G","E","T","A","V","E","L"]

{"sheet":"Puzzle 8A","index":18,"n_rows":1,"n_cols":3,"rows_kept":1}
[null,null,"08 - THE INHERITANCE GAME"]

{"sheet":"Puzzle 8B","index":19,"n_rows":1,"n_cols":3,"rows_kept":1}
[null,null,"08 - THE INHERITANCE GAME"]

{"sheet":"Puzzle 9A","index":20,"n_rows":1,"n_cols":3,"rows_kept":1}
[null,null,"09 – LLOYD LUNCHBOX’S LEAPING PUZZLE"]

{"sheet":"Puzzle 9B","index":21,"n_rows":12,"n_cols":16,"rows_kept":12}
[null,null,"09 – LLOYD LUNCHBOX’S LEAPING PUZZLE"]
[]
[null,null,"P","T","E","K","I","I","P","S",{"$nulls":3},"JUMPS"]
[null,null,"P","E","T","U","L","P","A","H",null,"LONG","è","STRADDLE","è","SPLIT"]
[null,null,"R","A","I","L","G","P","E","I",{"$nulls":5},"ê"]
[null,null,"END","F","A","R","C","R","H","T",null,"TUCK","ç","STAR","ç","PARACHUTE"]
[null,null,"T","A","K","E","E","L","O","T",null,"ê"]
[null,null,"R","G","S","S","T","E","H","S",null,"TOELOOP","è","HIGH","è","SALCHOW"]
[null,null,"E","R","C","O","O","A","D","O",{"$nulls":5},"ê"]
[null,null,"S","W","N","A","H","O","L","L",null,"PIKE","ç","TRIPLE","ç","BUNGEE"]
[null,null,"U","T","T","N","H","D","L","A"]
[null,null,"V","G","B","U","E","E","C","START"]

{"sheet":"Puzzle 10A","index":22,"n_rows":1,"n_cols":3,"rows_kept":1}
[null,null,"10 – GOODY BAG GIVEAWAY"]

{"sheet":"Puzzle 10B","index":23,"n_rows":1,"n_cols":3,"rows_kept":1}
[null,null,"10 – GOODY BAG GIVEAWAY"]

{"sheet":"Puzzle 11A","index":24,"n_rows":1,"n_cols":3,"rows_kept":1}
[null,null,"11 – GIGI SPARKLE’S BUSINESS MAZE"]

{"sheet":"Puzzle 11B","index":25,"n_rows":22,"n_cols":15,"rows_kept":22}
[null,null,"11 – GIGI SPARKLE’S BUSINESS MAZE"]
[{"$nulls":14},"WHAT IS THE MAXIMUM AMOUNT THAT CAN BE PAID INTO THE BANK?"]
[{"$nulls":14},{"v":24,"d":"£24.00"}]
[{"$nulls":14},"eliminate"]
[{"$nulls":14},"Stamina Drug"]
[{"$nulls":14},"and"]
[{"$nulls":14},"Jealousy"]
[{"$nulls":14},{"v":23,"d":"£23.00"}]
[{"$nulls":14},"eliminate"]
[{"$nulls":14},"Financial Gain"]
[{"$nulls":14},"and"]
[{"$nulls":14},"Salami Sauce"]
[{"$nulls":14},{"v":21,"d":"£21.00"}]
[{"$nulls":14},"eliminate"]
[{"$nulls":14},"Athlete's Foot Cream"]
[{"$nulls":14},"and"]
[{"$nulls":14},"Hate"]
[{"$nulls":14},{"v":20,"d":"£20.00"}]
[{"$nulls":14},"eliminate"]
[{"$nulls":14},"Tragic Accident"]
[{"$nulls":14},"and"]
[{"$nulls":14},"Face Cream"]

{"sheet":"Puzzle 12","index":26,"n_rows":1,"n_cols":3,"rows_kept":1}
[null,null,"12 - FRUIT AND VEG CROSSWORD"]

{"sheet":"Accusation","index":27,"n_rows":8,"n_cols":4,"rows_kept":8}
[null,null,"YOUR FORMAL ACCUSATION"]
[]
[]
[null,null,"You are accusing:  ",{"$f":"Mechanics!C2","v":"Nothing Accused"}]
[]
[null,null,"Of killing Clifton Curry with poisoned:  ",{"$f":"Mechanics!C3","v":"Nothing Accused"}]
[]
[null,null,"And the motive was:  ",{"$f":"Mechanics!C4","v":"Nothing Accused"}]

{"sheet":"Confession","index":28,"n_rows":19,"n_cols":26,"rows_kept":19}
[null,null,"CONFESSION"]
[]
[null,null,9,20,23,1,19,9,",",5,13,13,5,12,9,21,19,2,21,14,19,5,14,",",23,8]
[{"$nulls":8},",",{"$nulls":14},","]
[]
[null,null,15,11,9,12,12,5,4,3,12,9,6,20,15,14,".",9,23,1,19,10,5,1,12,15]
[{"$nulls":16},"."]
[]
[null,null,21,19,15,6,13,25,19,20,5,16,2,20,15,20,8,5,18,"'",19,19,21,3,3,5]
[{"$nulls":19},"'"]
[]
[null,null,19,19,".",1,14,4,19,15,9,16,15,9,19,15,14,5,4,8,9,13,23,9,20,8]
[{"$nulls":4},"."]
[]
[null,null,1,20,8,12,5,20,5,"'",19,6,15,15,20,3,18,5,1,13,12,1,3,5,4,23]
[{"$nulls":9},"'"]
[]
[null,null,9,20,8,18,1,20,16,15,9,19,15,14,"!"]
[{"$nulls":14},"!"]

{"sheet":"Solutions","index":29,"n_rows":37,"n_cols":5,"rows_kept":37,"hidden":true}
[null,null,"SOLUTIONS TO PUZZLES"]
[]
[null,null,"01 – SIR HAMISH’S POISONED PUMPKIN MAZE","Show Solution?","No"]
[null,null,"The correct route through the maze takes you through the pumpkins labelled N, I, O, P. T and finally O.  These letters can be rearranged to spell “potion”.  Eliminate Love Potion – If Sir Hamish is innocent"]
[]
[null,null,"02 – SMELLY WORD SEARCH","Show Solution?","No"]
[null,null,"The unused letters, reading left to right, top to bottom, spell out “Salami Sauce” and “Chief Supply Agent”.  Sir Hamish Hogwash is the company’s Chief Supply Agent.  Eliminate Salami Sauce and Sir Hamish Hogwash."]
[]
[null,null,"03 – MAVIS CHEEK’S “TAKE A LETTER” PUZZLE","Show Solution?","No"]
[null,null,"The firm that successfully delivers the letter is “Cosy Couriers”. Eliminate Hate and Face Lift Cream – If Mavis Cheek is innocent."]
[]
[null,null,"04 – PUMPKIN NUMBER PUZZLE","Show Solution?","No"]
[null,null,"The number that goes into the yellow square is 14. “Homicidal Mania” and “Tragic Accident” both have exactly 14 letters.  Eliminate Homicidal Mania and Tragic Accident."]
[null,null,"  "]
[null,null,"05 – LADY FADING’S BEAUTY PRODUCT JIG","Show Solution?","No"]
[null,null,"The letters in the green squares can be rearranged to spell “Stamina Drug”. The letters in the pink squares can be rearranged to spell “Vengeance”.  Eliminate Stamina Drug and Vengeance – If Lady Fading is innocent."]
[]
[null,null,"06 – NEW PRODUCT PUZZLE","Show Solution?","No"]
[null,null,"The next Pungent Pumpkin product to be commercially developed is Stain Remover. This is a household cleaning product.  Eliminate Lloyd Lunchbox."]
[]
[null,null,"07 – PROFESSOR BUNSEN’S FANTASTIC FABRIC","Show Solution?","No"]
[null,null,"The unused letters, reading left to right, top to bottom, spell “Jealousy” and “Aftershave”. Eliminate Jealousy and Irresistible Aftershave – If Professor Bunsen is innocent."]
[]
[null,null,"08 – THE INHERITANCE GAME","Show Solution?","No"]
[null,null,"Lady 'Beauty' Fading is the only player who does not end up on an INHERITANCE square.  Eliminate Lady 'Beauty' Fading."]
[]
[null,null,"09 – LLOYD LUNCHBOX’S LEAPING PUZZLE","Show Solution?","No"]
[null,null,"The letters you do not leap onto, reading left to right, top to bottom, spell out “Aftershave”.  Eliminate Irresistible Aftershave – If Lloyd Lunchbox is innocent."]
[]
[null,null,"10 – GOODY BAG GIVEAWAY","Show Solution?","No"]
[null,null,"Bags M and K both contain battery acid, rat poison, athlete’s foot cream and irresistible aftershave. Mavis Cheek is the only item to contain both the letters M and K.  Eliminate Mavis Cheek."]
[]
[null,null,"11 – GIGI SPARKLE’S BUSINESS MAZE","Show Solution?","No"]
[null,null,"The best route to the bank is as follows: START - £6 Invoice - £5 Expense - £5 Invoice - £4 Invoice - £7 Invoice - BANK. It incurs expenses of £27, meaning there is £23 to be paid into the bank.  Eliminate Financial Gain and Salami Sauce – If Gigi Sparkle is innocent."]
[]
[null,null,"13 – FRUIT AND VEG CROSSWORD","Show Solution?","No"]
[null,null,"Across: 1 – Asparagus, 4 – Apple, 7 – Tomato, 8 – Blackberry, 16 – Pea, 18 – Ginger, 19 – Marrow, 20 – Orange, 22 – Parsnip, 25 – Garlic, 29 – Yam, 30 – Plum, 31 – Chestnuts, 32 – Basil, 33 – Celery, 35 – Rocket, 39 – Pepper, 42 – Raspberry, 44 – Rhubarb, 45 – Sage, 46 – Clove, 48 – Avocado, 50 – Squash, 51 – Beetroot, 52 – Turnip, 53 – Kumquat, 54 – Banana.\n\nDown: 2 – Strawberry, 3 – Horseradish, 5 – Pawpaw, 6 – Greengage, 8 – Blueberry, 9 – Carrot, 10 – Onion, 11 – Mango, 12 – Fig, 13 – Lemon, 14 – Currant, 15 – Broad Bean, 17 – Grape, 21 – Gooseberry, 24 – Cucumber, 26 – Cauliflower, 27 – Blackcurrant, 28 – Mustard, 34 – Endive, 36 – Cabbage, 37 – Spinach, 38 – Apricot, 40 – Pear, 41 – Peach, 43 – Date, 47 – Leek, 49 – Okra.\n\nThe letters in the pink squares can be rearranged to spell “Gigi Sparkle”.  The letters in the green squares can be rearranged to spell “Tragic Accident”.  Eliminate Gigi Sparkle and Tragic Accident."]

{"sheet":"Other Games","index":30,"n_rows":31,"n_cols":12,"rows_kept":31,"merged":[[4,11,6,11],[12,11,14,11]]}
[{"$nulls":6},"A SELECTION OF SOME OF THE MERRYMURDER PRODUCTS"]
[]
[null,null,"FULL PARTY GAMES",{"$nulls":3},"MURDER IN AN HOUR GAMES",{"$nulls":3},"MURDER MYSTERY PUZZLE BOOKS"]
[null,null,"Make an evening of it!",{"$nulls":3},"Costumeless impromptu games lasting about an hour",{"$nulls":3},"Solo challenges for avid puzzlers"]
[null,"The Merrymurder","","The Merrymurder","","Murder in an Hour","","Murder in an Hour","","The Pungent Pumpkin","","DOWNLOAD\nFOR FREE"]
[null,"Wine Tasting Game","","Pantocrime","","at Cloo Hall ","","at the BBQ","","Poisoner Puzzle Book","ç"]
[null,"9 to 12 players",null,"12 to 18 players",null,"3 to 10 players",null,"3 to 10 players",null,"14 puzzles"]
[]
[null,"Slaughter","","Murder","","Murder in an Hour","","Murder in an Hour","","Who Stole","","Monster"]
[null,"at the Circus ","","at the North Pole ","","with Pumpkin Poison","","at the Bake Off","","Santa’s Sleigh? ","","Birthday Party"]
[null,"13 to 18 players",null,"14 to 18 players",null,"4 to 12 players",null,"4 to 12 players",null,"13 puzzles",null,"13 puzzles"]
[]
[null,"The Pungent","","The Murder","","Murder in an Hour at the","","Murder in an Hour","","The Great Easter",null,"NOW AVAILABLE AS A MICROSOFT EXCEL BASED PUZZLE BOOK"]
[null,"Pumpkin Poisoner ","","of Mrs Whyte ","","Psychic Coffee Morning","","at Monster Mansion","","Egg Theft","ç"]
[null,"8 to 10 players",null,"8 to 11 players",null,"4 to 12 players",null,"4 to 12 players",null,"13 puzzles"]
[]
[null,"The Eight Deadly Sins","","An Easter","","Murder in an Hour","","Murder in an Hour","","Who took the Tail","","Who Flame-Grilled"]
[null,"Pirate/Cannibal Bbq ","","Extravaganza ","","in Space","","in Camelot","","off the Easter Bunny? ","","Frosty? "]
[null,"11 to 14 players",null,"11 to 15 players",null,"4 to 12 players",null,"4 to 12 players",null,"21 puzzles",null,"20 puzzles"]
[]
[null,"The Wake","","Ten Little","","Murder in an Hour","","Murder in an Hour","","Murder","","Murder"]
[null,"for Humpty Dumpty ","","Vampires ","","with Robin Hood","","with Santa’s Reindeer","","at Herbwell Hall","","at the Seaside"]
[null,"12 to 16 players",null,"10 players",null,"4 to 12 players",null,"4 to 12 players",null,"22 puzzles",null,"21 puzzles"]
[]
[null,"The Cutting It","","Orgy","",{"$nulls":3},"","The Shakespeare","","Who Spooked"]
[null,"Killer ","","of Death ","",{"$nulls":3},"","Murder Mystery","","Spook? "]
[null,"13 to 16 players",null,"16 to 20 players",{"$nulls":5},"36 puzzles",null,"20 puzzles"]
[]
[{"$nulls":9},"Murder at","","Murder at the"]
[{"$nulls":9},"Cainem College","","Surprise Birthday Party"]
[{"$nulls":9},"47 puzzles",null,"38 puzzles"]

{"sheet":"Bonus Puzzle","index":31,"n_rows":14,"n_cols":19,"rows_kept":14}
[null,null,"13 - BONUS PUZZLE"]
[]
[null,null,"I","H","V","I","L","A","D","Y","T","U","A","E","B",null,null,"ITEMS TO FIND"]
[null,null,"N","N","O","T","F","I","L","C","S","H","I","M","T",null,"PUNGENT","SIR","LADY"]
[null,null,"S","I","R","G","M","B","U","N","S","E","N","M","Y",null,"PUMPKIN","HAMISH","BEAUTY"]
[null,null,"P","K","G","N","W","W","E","I","C","L","B","E","G",null,"PROCESSING","HOGWASH","FADING"]
[null,null,"E","P","S","I","V","A","M","S","U","B","E","L","N",null,"COMPANY","PROFESSOR","GIGI"]
[null,null,"C","M","I","S","G","A","S","N","R","R","L","I","I",null,"CLIFTON","EMMELIUS","SPARKLE"]
[null,null,"T","U","T","S","H","E","C","H","R","O","K","U","D",null,"CURRY","BUNSEN","LLOYD"]
[null,null,"O","P","K","E","E","H","C","F","Y","W","R","S","A",null,"INSPECTOR","MAVIS","LUNCHBOX"]
[null,null,"R","O","R","C","B","M","O","D","R","N","A","E","F",null,"BROWN","CHEEK"]
[null,null,"B","O","C","O","M","P","A","N","Y","O","P","K","S"]
[null,null,"A","N","X","R","P","R","O","F","E","S","S","O","R"]
[null,null,"D","G","A","P","U","N","G","E","N","T","M","E","S"]

{"sheet":"Suspects_R","index":32,"n_rows":18,"n_cols":5,"rows_kept":18,"hidden":true}
[null,null,"MEET THE SUSPECTS"]
[]
[{"$nulls":3},"Click on the suspect's name below and use the drop-down box to meet another suspect"]
[{"$nulls":3},"PROFESSOR EMMELIUS BUNSEN"]
[]
[{"$nulls":3},{"$f":"VLOOKUP($D$4,$C$13:$E$18,2,FALSE)","v":"Research & Development Director"}]
[{"$nulls":3},{"$f":"VLOOKUP($D$4,$C$13:$E$18,3,FALSE)","v":"Ah, hello there. I am Professor Bunsen, the Research & Development Director of the Pungent Pumpkin Processing Company. I am responsible for creating all the exciting and diverse products derived from the pungent pumpkin. Clifton was my step-brother. We each owned 24% of the shares in the company. I assume that his shares will now come to me. With Clifton having all the business expertise and commercial knowledge, I sometimes felt a little overshadowed by my step-brother. But I am sincerely sorry that he is dead."}]
[]
[]
[]
[]
[]
[null,null,"SIR HAMISH HOGWASH","Chief Pumpkin Supply Agent","How do you do. I am Sir Hamish Hogwash, aged 60. The Hogwash family own the island of Tunga Wonga in the far off Pacific ocean. It is on this island that the Pungent Pumpkins grow. I sell these pumpkins to the Pungent Pumpkin Processing Company, and am therefore their Chief Pumpkin Supply Agent. I did not much like Clifton. I do not feel he paid me a fair price for my pumpkins. And neither did I like his personal habits – he was always scratching between his toes!"]
[null,null,"PROFESSOR EMMELIUS BUNSEN","Research & Development Director","Ah, hello there. I am Professor Bunsen, the Research & Development Director of the Pungent Pumpkin Processing Company. I am responsible for creating all the exciting and diverse products derived from the pungent pumpkin. Clifton was my step-brother. We each owned 24% of the shares in the company. I assume that his shares will now come to me. With Clifton having all the business expertise and commercial knowledge, I sometimes felt a little overshadowed by my step-brother. But I am sincerely sorry that he is dead."]
[null,null,"LADY 'BEAUTY' FADING","Chief Shareholder & Chairwoman","I am Lady “Beauty” Fading and my heart is broken! Clifton Curry was my boyfriend and the man I intended to marry. We met in St Tropez when I was cruising on my yacht (I am a very wealthy divorcee). And we hit it off at once. He was, of course, a few years younger than myself, but that didn’t matter to either of us. To show my love for him, I provided half of the funding for the Pungent Pumpkin Processing Company. I am therefore the Chief Shareholder and own 52% of the shares. But I would surrender them all to have my boyfriend back for just a minute!"]
[null,null,"MAVIS CHEEK","Directors’ Secretary","Good day. I am Mavis Cheek, secretary to the directors of the Pungent Pumpkin Processing Company.  I am very efficient and intelligent, and able to wrap my bosses around my little finger! I am really the power behind the scenes, and most of Clifton’s success was due to me. Precious little thanks I got from him though. I hate ingratitude! Still, now he is dead, I will come into my own. I am sure Professor Bunsen will give me a free hand, and I will effectively be the Managing Director of the company! With remuneration to match! "]
[null,null,"GIGI SPARKLE","Marketing Consultant","Ciao darling! I am Gigi Sparkle, creative force behind the “Super Sparkle” Marketing Agency. I provide all the marketing for the Pungent Pumpkin Processing Company – which includes hiring the celebrated hurdler Lloyd Lunchbox to be the face of Pungent Pumpkin Products! Clifton was incredibly impressed by this. Although some people say I am a ruthless, vengeful businesswoman, I am really sad that Clifton is dead – even though he was extremely forgetful about paying my invoices!"]
[null,null,"LLOYD LUNCHBOX","Commonwealth Games’ Hurdler","High five buddy! I am Lloyd Lunchbox, a silver medallist hurdler from the Commonwealth Games. I have been signed up by Gigi Sparkle to be the face of the Pungent Pumpkin Processing Company – and to recommend their products wherever I go. It is not exactly my first choice of sponsorship, but a recent drug scandal has affected my marketability. Fortunately I got my ban overturned. I am shocked by Clifton Curry’s death, but I can’t afford to let it interfere with my training and quest for gold at the next Olympics."]

{"sheet":"Elimination Grid_R","index":33,"n_rows":11,"n_cols":8,"rows_kept":11,"hidden":true}
[null,null,"ELIMINATION GRID"]
[]
[null,null,"Suspects",{"$nulls":4},"Click on a suspect/item to eliminate them. Click again to cancel your elimination."]
[null,null,"Sir Hamish Hogwash","Professor\nEmmelius Bunsen","Lady 'Beauty' Fading","Mavis\nCheek","Gigi\nSparkle","Lloyd\nLunchbox"]
[null,null,"Pungent Pumpkin Products"]
[null,null,"Athlete's Foot Cream*","Industrial Strength Face Cream*","Love Potion","Irresistible Aftershave*","Salami\nSauce","Stamina\nDrug"]
[null,null,"Motives",null,"POTION"]
[null,null,"Financial\nGain","Hate","Homicidal\nMania","Jealousy","Tragic\nAccident","Vengeance"]
[null,null,"* Pungent Pumpkin Rat Poison is so deadly it can kill even when absorbed through the skin."]
[]
[{"$nulls":7},"www.merrymurder.com"]

{"sheet":"Puzzle 2_R","index":34,"n_rows":20,"n_cols":21,"rows_kept":20,"hidden":true}
[null,null,"02 - SMELLY WORD SEARCH"]
[]
[]
[]
[null,null,"C","S","H","D","A","E","R","B","H","S","E","R","F","S","A",null,null,"SMELLY ITEMS!"]
[null,null,"P","I","O","L","A","R","O","T","T","E","N","E","G","G","S",null,"APPLE PIE","HONEYSUCKLE","ROSEMARY"]
[null,null,"I","L","N","S","L","A","T","I","P","S","O","H","M","L","I",null,"BACON","HOSPITALS","ROSES"]
[null,null,"N","A","E","N","T","S","O","P","M","O","C","T","L","U","N",null,"BUTTERSCOTCH","LEATHER","ROTTEN EGGS"]
[null,null,"E","G","Y","R","A","M","E","S","O","R","S","A","S","E","R",null,"CHEESE","NEW BOOKS","SCENT"]
[null,null,"C","E","S","C","S","M","A","R","U","K","B","E","L","P","E",null,"CINNAMON","NEW TENNIS BALLS","SILAGE"]
[null,null,"O","C","U","O","E","P","O","E","U","S","C","L","H","I","T",null,"COFFEE","PAINT","SKUNK"]
[null,null,"N","S","C","F","A","E","E","N","I","L","O","S","A","G","T",null,"COMPOST","PEANUT BUTTER","SOAP"]
[null,null,"E","K","K","F","G","P","K","N","I","P","W","E","A","F","U",null,"FRESH BREAD","PEPPERMINT","SOCKS"]
[null,null,"S","O","L","E","O","P","N","I","F","E","E","R","S","E","B",null,"FRESH MOWN LAWN","PIG FEED","SWEAT"]
[null,null,"E","O","E","E","D","E","O","D","A","U","L","L","P","E","T",null,"GARLIC","PINE CONES","VANILLA"]
[null,null,"E","B","P","L","T","R","C","T","N","I","A","P","P","D","U",null,"GASOLINE","POLLEN","WET DOG"]
[null,null,"H","W","Y","W","E","M","A","S","C","E","N","T","A","P","N",null,"GLUE","ROAST DINNER"]
[null,null,"C","E","E","G","W","I","B","A","V","A","N","I","L","L","A"]
[null,null,"E","N","W","A","L","N","W","O","M","H","S","E","R","F","E"]
[null,null,"N","T","B","U","T","T","E","R","S","C","O","T","C","H","P"]

{"sheet":"Puzzle 4_R","index":35,"n_rows":11,"n_cols":13,"rows_kept":11,"hidden":true}
[null,null,"04 - NUMBER CRUNCHING"]
[]
[null,null,20,"÷",null,"=",4,null,null,"-",12,"=",16]
[null,null,"x",null,"x",{"$nulls":3},"÷",{"$nulls":3},"+"]
[null,null,3,null,12,"÷",6,"x",null,"x",3,"="]
[null,null,"=",null,"÷",{"$nulls":3},"=",{"$nulls":3},"+"]
[{"$nulls":3},"+",null,"-",null,"+",4,"-",39,"="]
[{"$nulls":4},"=",null,"-",{"$nulls":3},"÷",null,"-"]
[null,null,12,"+",null,"=",18,null,4,"x",null,"="]
[{"$nulls":6},"=",{"$nulls":3},"=",null,"="]
[null,null,2,"x",3,"x",null,"=",54,null,3]

{"sheet":"Puzzle 5B_R","index":36,"n_rows":41,"n_cols":22,"rows_kept":41,"hidden":true}
[null,null,"05 – LADY FADING’S BEAUTY PRODUCT JIG"]
[]
[{"$nulls":19},"BEAUTY PRODUCTS"]
[{"$nulls":18},"3 Letters","6 Letters","8 Letters"]
[{"$nulls":18},"DYE","LASHES","EYELINER"]
[{"$nulls":18},"GEL","LOTION","LIPSTICK"]
[{"$nulls":18},"4 Letters","POWDER","9 Letters"]
[{"$nulls":18},"WASH","PRIMER","BATH SALTS"]
[{"$nulls":18},"5 Letters","7 Letters","COLD CREAM"]
[{"$nulls":18},"BOTOX","BLUSHER","CONCEALER"]
[{"$nulls":18},"CREAM","BRONZER","EXFOLIANT"]
[{"$nulls":18},"GLOSS","EYE PACK","FACE CREAM"]
[{"$nulls":18},"PAINT","GLITTER","FACEMASKS"]
[{"$nulls":18},"ROUGE","LACQUER","HAIRSPRAY"]
[{"$nulls":18},"TINTS","LIP BALM","10 Letters"]
[{"$nulls":18},"TONER","MASCARA","BUBBLE BATH"]
[{"$nulls":18},"WIPES","MUDPACK","FACE POWDER"]
[{"$nulls":15},"X",{"$nulls":3},"PERFUME","FOUNDATION"]
[{"$nulls":19},"SHAMPOO","LIP PLUMPER"]
[{"$nulls":18},"11 Letters","VARNISH","NAIL POLISH"]
[{"$nulls":18},"SCENTED SOAP","COCOA BUTTER","MOISTURISER"]
[{"$nulls":18},"13 Letters","EYE BRIGHTENER"]
[]
[{"$nulls":13},"S"]
{"$rows_empty":16}
[{"$nulls":21},"VARNISH"]

{"sheet":"Puzzle 7B_R","index":37,"n_rows":18,"n_cols":18,"rows_kept":18,"hidden":true}
[null,null,"07 – PROFESSOR BUNSEN’S FANTASTIC FABRIC"]
[]
[null,null,"J","A","R","G","N","E","G","C","D","A","O","R",null,null,"FANTASTIC FABRICS"]
[null,null,"W","O","I","E","O","R","A","L","O","E","Z","B",null,"ARGENTAN LACE","EGYPTIAN COTTON","MUSLIN"]
[null,null,"S","R","A","N","D","G","E","T","T","E","T","E",null,"BENGALINE SILK","FAUX FUR","OILSKIN"]
[null,null,"T","E","H","T","L","A","A","W","H","I","N","N",null,"BROADCLOTH","FLANNELETTE","POLAR FLEECE"]
[null,null,"L","D","S","A","N","C","E","E","C","U","S","G",null,"CAMELS HAIR","GABARDINE","SAILCLOTH"]
[null,null,"O","W","L","E","L","I","D","O","U","M","L","A",null,"CHINTZ","GEORGETTE","TAFFETA"]
[null,null,"O","S","E","C","S","O","J","A","G","Y","I","H",null,"CREPE DE CHINE","IRISH LINEN","VELVET"]
[null,null,"L","H","M","A","K","R","A","B","A","E","N","C",null,"DONEGAL TWEED","JACQUARD KNIT","WORSTED WOOL"]
[null,null,"I","S","I","R","I","D","C","Q","I","S","F","E",null,"DRUGGET","LEATHER"]
[null,null,"N","H","T","O","N","T","E","U","L","T","T","D"]
[null,null,"E","N","E","L","E","T","G","A","K","N","I","E"]
[null,null,"E","N","L","C","O","P","Y","R","D","R","S","P"]
[null,null,"S","A","I","A","L","T","I","A","N","C","R","E"]
[null,null,"H","L","F","R","U","A","F","F","E","O","A","V"]
[null,null,"E","E","D","F","X","E","N","O","T","T","E","V"]
[null,null,"C","E","R","U","G","G","E","T","A","V","E","L"]

{"sheet":"Puzzle 9B_R","index":38,"n_rows":12,"n_cols":16,"rows_kept":12,"hidden":true}
[null,null,"09 – LLOYD LUNCHBOX’S LEAPING PUZZLE"]
[]
[null,null,"P","T","E","K","I","I","P","S",{"$nulls":3},"JUMPS"]
[null,null,"P","E","T","U","L","P","A","H",null,"LONG","è","STRADDLE","è","SPLIT"]
[null,null,"R","A","I","L","G","P","E","I",{"$nulls":5},"ê"]
[null,null,"END","F","A","R","C","R","H","T",null,"TUCK","ç","STAR","ç","PARACHUTE"]
[null,null,"T","A","K","E","E","L","O","T",null,"ê"]
[null,null,"R","G","S","S","T","E","H","S",null,"TOELOOP","è","HIGH","è","SALCHOW"]
[null,null,"E","R","C","O","O","A","D","O",{"$nulls":5},"ê"]
[null,null,"S","W","N","A","H","O","L","L",null,"PIKE","ç","TRIPLE","ç","BUNGEE"]
[null,null,"U","T","T","N","H","D","L","A"]
[null,null,"V","G","B","U","E","E","C","START"]

{"sheet":"Puzzle 12_R","index":39,"n_rows":1,"n_cols":3,"rows_kept":1,"hidden":true}
[null,null,"12 - FRUIT AND VEG CROSSWORD"]

{"sheet":"Bonus Puzzle_R","index":40,"n_rows":14,"n_cols":19,"rows_kept":14,"hidden":true}
[null,null,"13 - BONUS PUZZLE"]
[]
[null,null,"I","H","V","I","L","A","D","Y","T","U","A","E","B",null,null,"ITEMS TO FIND"]
[null,null,"N","N","O","T","F","I","L","C","S","H","I","M","T",null,"PUNGENT","SIR","LADY"]
[null,null,"S","I","R","G","M","B","U","N","S","E","N","M","Y",null,"PUMPKIN","HAMISH","BEAUTY"]
[null,null,"P","K","G","N","W","W","E","I","C","L","B","E","G",null,"PROCESSING","HOGWASH","FADING"]
[null,null,"E","P","S","I","V","A","M","S","U","B","E","L","N",null,"COMPANY","PROFESSOR","GIGI"]
[null,null,"C","M","I","S","G","A","S","N","R","R","L","I","I",null,"CLIFTON","EMMELIUS","SPARKLE"]
[null,null,"T","U","T","S","H","E","C","H","R","O","K","U","D",null,"CURRY","BUNSEN","LLOYD"]
[null,null,"O","P","K","E","E","H","C","F","Y","W","R","S","A",null,"INSPECTOR","MAVIS","LUNCHBOX"]
[null,null,"R","O","R","C","B","M","O","D","R","N","A","E","F",null,"BROWN","CHEEK"]
[null,null,"B","O","C","O","M","P","A","N","Y","O","P","K","S"]
[null,null,"A","N","X","R","P","R","O","F","E","S","S","O","R"]
[null,null,"D","G","A","P","U","N","G","E","N","T","M","E","S"]